Target
Beta-secretase 1
Ligand
BDBM93275
Substrate
Meas. Tech.
Fluorescence Resonance Energy Transfer (FRET) Assay
Temperature
293.15±n/a K
IC50
>2.00e+5±n/a nM
Comments
extracted
Citation
 Larbig, GSchmidt, B Synthesis of tetramic and tetronic acids as beta-secretase inhibitors. J Comb Chem 8:480-90 (2006)  
Target
Name:
Beta-secretase 1
Synonyms:
ASP2 Aspartyl protease 2 BACE1 Beta-secretase (BACE) Beta-secretase 1 (BACE 1) Beta-secretase 1 (BACE1) Beta-site amyloid precursor protein cleaving enzyme 1 Memapsin-2 beta-Secretase (BACE-1) | beta-Secretase (BACE1)
Type:
Protein
Mol. Mass.:
55755.10
Organism:
Homo sapiens (Human)
Description:
P56817
Residue:
501
  
Inhibitor
Name:
BDBM93275
Synonyms:
Tetramic acid, 77
Type:
Small molecule
Emp. Form.:
C20H17F3O3S
Mol. Mass.:
394.407
SMILES:
FC(F)(F)c1cccc(CSC2C(=O)OC(CCc3ccccc3)C2=O)c1
: