Target
L-lactate dehydrogenase
Ligand
BDBM93309
Substrate
Meas. Tech.
Enzyme Assay
IC50
>2.00e+5±n/a nM
Citation
 Choi, SRBeeler, ABPradhan, AWatkins, EBRimoldi, JMTekwani, BAvery, MA Generation of oxamic acid libraries: antimalarials and inhibitors of Plasmodium falciparum lactate dehydrogenase. J Comb Chem 9:292-300 (2007)  
Target
Name:
L-lactate dehydrogenase
Synonyms:
Lactate dehydrogenase (LDH)
Type:
Protein
Mol. Mass.:
28939.78
Organism:
Plasmodium falciparum
Description:
B9UDZ5
Residue:
267
  
Inhibitor
Name:
BDBM93309
Synonyms:
Oxamic Acid/Ester, 27
Type:
Small molecule
Emp. Form.:
C12H14N2O3
Mol. Mass.:
234.2512
SMILES:
OC(=O)C(=O)N1CCN(CC1)c1ccccc1
: