Target
L-lactate dehydrogenase
Ligand
BDBM93298
Substrate
Meas. Tech.
Enzyme Assay
IC50
1.86e+5±n/a nM
Citation
 Choi, SRBeeler, ABPradhan, AWatkins, EBRimoldi, JMTekwani, BAvery, MA Generation of oxamic acid libraries: antimalarials and inhibitors of Plasmodium falciparum lactate dehydrogenase. J Comb Chem 9:292-300 (2007)  
Target
Name:
L-lactate dehydrogenase
Synonyms:
Lactate dehydrogenase (LDH)
Type:
Protein
Mol. Mass.:
36018.34
Organism:
Bos taurus (Bovine)
Description:
E1BNS9
Residue:
332
  
Inhibitor
Name:
BDBM93298
Synonyms:
Oxamic Acid/Ester, 16
Type:
Small molecule
Emp. Form.:
C8H9NO4
Mol. Mass.:
183.1614
SMILES:
CN(Cc1ccco1)C(=O)C(O)=O
: