Target
L-lactate dehydrogenase
Ligand
BDBM93299
Substrate
Meas. Tech.
Enzyme Assay
IC50
>2.00e+5±n/a nM
Citation
 Choi, SRBeeler, ABPradhan, AWatkins, EBRimoldi, JMTekwani, BAvery, MA Generation of oxamic acid libraries: antimalarials and inhibitors of Plasmodium falciparum lactate dehydrogenase. J Comb Chem 9:292-300 (2007)  
Target
Name:
L-lactate dehydrogenase
Synonyms:
Lactate dehydrogenase (LDH)
Type:
Protein
Mol. Mass.:
36018.34
Organism:
Bos taurus (Bovine)
Description:
E1BNS9
Residue:
332
  
Inhibitor
Name:
BDBM93299
Synonyms:
Oxamic Acid/Ester, 17
Type:
Small molecule
Emp. Form.:
C13H11NO3
Mol. Mass.:
229.2313
SMILES:
OC(=O)C(=O)NCc1cccc2ccccc12
: