Target
L-lactate dehydrogenase
Ligand
BDBM93316
Substrate
Meas. Tech.
Enzyme Assay
IC50
>2.00e+5±n/a nM
Citation
 Choi, SRBeeler, ABPradhan, AWatkins, EBRimoldi, JMTekwani, BAvery, MA Generation of oxamic acid libraries: antimalarials and inhibitors of Plasmodium falciparum lactate dehydrogenase. J Comb Chem 9:292-300 (2007)  
Target
Name:
L-lactate dehydrogenase
Synonyms:
Lactate dehydrogenase (LDH)
Type:
Protein
Mol. Mass.:
36018.34
Organism:
Bos taurus (Bovine)
Description:
E1BNS9
Residue:
332
  
Inhibitor
Name:
BDBM93316
Synonyms:
Oxamic Acid/Ester, 34
Type:
Small molecule
Emp. Form.:
C7H13NO3
Mol. Mass.:
159.183
SMILES:
CC(C)CCNC(=O)C(O)=O
: