Target
L-lactate dehydrogenase
Ligand
BDBM93323
Substrate
Meas. Tech.
Enzyme Assay
IC50
8.8e+4±n/a nM
Citation
 Choi, SRBeeler, ABPradhan, AWatkins, EBRimoldi, JMTekwani, BAvery, MA Generation of oxamic acid libraries: antimalarials and inhibitors of Plasmodium falciparum lactate dehydrogenase. J Comb Chem 9:292-300 (2007)  
Target
Name:
L-lactate dehydrogenase
Synonyms:
Lactate dehydrogenase (LDH)
Type:
Protein
Mol. Mass.:
36018.34
Organism:
Bos taurus (Bovine)
Description:
E1BNS9
Residue:
332
  
Inhibitor
Name:
BDBM93323
Synonyms:
Oxamic Acid/Ester, 41
Type:
Small molecule
Emp. Form.:
C12H15NO3
Mol. Mass.:
221.2524
SMILES:
OC(=O)C(=O)NCCCCc1ccccc1
: