Target
Amyloid-beta precursor protein
Ligand
BDBM93325
Substrate
Meas. Tech.
Inhibition Assay
pH
7±0
Temperature
310.15±0 K
IC50
4.9±0.0 nM
Citation
 Vaccaro, HAZhao, ZClader, JWSong, LTerracina, GZhang, LPissarnitski, DA Solution-phase parallel synthesis of carbamates as gamma-secretase inhibitors. J Comb Chem 10:56-62 (2008)  
Target
Name:
Amyloid-beta precursor protein
Synonyms:
A4 ABPP AICD-50 AICD-59 AID(57) APP Alzheimer disease amyloid protein Amyloid beta Protein Amyloid beta protein Abeta(1-42) Amyloid intracellular domain 57 Amyloid protein (Abeta42b) Beta amyloid A4 protein Beta-APP42 Beta-amyloid protein 42 C83 CVAP Gamma Secretase Gamma-CTF(57) Gamma-secretase Gamma-secretase C-terminal fragment 57 P3(40) PN-II Protease nexin-II S-APP-beta Soluble APP-beta | beta-Amyloid Precursor Protein (APP)
Type:
Single-pass type I membrane protein
Mol. Mass.:
86890.41
Organism:
Homo sapiens (Human)
Description:
P05067
Residue:
770
  
Inhibitor
Name:
BDBM93325
Synonyms:
Carbamate {3,21}, 1
Type:
Small molecule
Emp. Form.:
C31H41F3N4O6S
Mol. Mass.:
654.741
SMILES:
OCCN(CCO)C1CCN(CC1)NC(=O)OC1(CC1)[C@H]1CCCC(N1CS(=O)(=O)c1ccc(F)c(F)c1)c1cccc(F)c1
: