Target
Epidermal growth factor receptor
Ligand
BDBM4001
Substrate
poly(E, A, Y)
Meas. Tech.
Kinase Inhibition Assay
pH
7.4±n/a
Temperature
295.15±n/a K
IC50
850±n/a nM
Citation
 Thompson, AMFry, DWKraker, AJDenny, WA Tyrosine kinase inhibitors. 2. Synthesis of 2,2'-dithiobis(1H-indole-3-alkanamides) and investigation of their inhibitory activity against epidermal growth factor receptor and pp60v-src protein tyrosine kinases. J Med Chem 37:598-609 (1994)  
Target
Name:
Epidermal growth factor receptor
Synonyms:
EGF Receptor Substrate EGFR_HUMAN ERBB1 Epidermal Growth Factor Receptor erbB-1 Epidermal growth factor receptor (EGFR) HER1 Proto-oncogene c-ErbB-1 Tyrosine-Protein Kinase ErbB-1
Type:
Receptor Kinase Domain
Mol. Mass.:
134279.59
Organism:
Homo sapiens (Human)
Description:
P00533
Residue:
1210
  
Inhibitor
Name:
BDBM4001
Synonyms:
1 H-indole-3-alkanamide deriv. 10j | N-benzyl-3-[2-({3-[2-(benzylcarbamoyl)ethyl]-1H-indol-2-yl}disulfanyl)-1H-indol-3-yl]propanamide
Type:
Small organic molecule
Emp. Form.:
C36H34N4O2S2
Mol. Mass.:
618.811
SMILES:
O=C(CCc1c(SSc2[nH]c3ccccc3c2CCC(=O)NCc2ccccc2)[nH]c2ccccc12)NCc1ccccc1
:
Substrate
Name:
poly(E, A, Y)
Synonyms:
Type:
Random Polymer
Mol. Mass.:
358.43
Organism:
Description:
A 6:3:1 random copolymer of glutamate, alanine and tyrosine. 5 uM ATP containing 0.2 uCi of 0.5-3 Ci/mmol 32P labeled ATP.
Residue:
3
NA