Target
Tyrosine-protein kinase transforming protein Src
Ligand
BDBM4002
Substrate
poly(E,Y)
Meas. Tech.
Kinase Inhibition Assay
IC50
1800±n/a nM
Citation
 Thompson, AMFry, DWKraker, AJDenny, WA Tyrosine kinase inhibitors. 2. Synthesis of 2,2'-dithiobis(1H-indole-3-alkanamides) and investigation of their inhibitory activity against epidermal growth factor receptor and pp60v-src protein tyrosine kinases. J Med Chem 37:598-609 (1994)  
Target
Name:
Tyrosine-protein kinase transforming protein Src
Synonyms:
P60-Src V-SRC | pp60v-src
Type:
Enzyme
Mol. Mass.:
58884.32
Organism:
Avian sarcoma virus
Description:
P00525
Residue:
526
  
Inhibitor
Name:
BDBM4002
Synonyms:
1 H-indole-3-alkanamide deriv. 10k methyl 4-({3-[2-({3-[2-({[4-(methoxycarbonyl)phenyl]methyl}carbamoyl)ethyl]-1H-indol-2-yl}disulfanyl)-1H-indol-3-yl]propanamido}methyl)benzoate
Type:
Small organic molecule
Emp. Form.:
C40H38N4O6S2
Mol. Mass.:
734.883
SMILES:
COC(=O)c1ccc(CNC(=O)CCc2c(SSc3[nH]c4ccccc4c3CCC(=O)NCc3ccc(cc3)C(=O)OC)[nH]c3ccccc23)cc1
:
Substrate
Name:
poly(E,Y)
Synonyms:
Type:
Random Polymer
Mol. Mass.:
358.43
Organism:
Description:
poly[(glu)4(tyr)l]. 5 uM ATP containing 0.2 uCi 32P labeled ATP as co-substrate.
Residue:
3
NA