Target
Prolyl hydroxylase EGLN2
Ligand
BDBM93422
Substrate
Meas. Tech.
PHD Enzymatic Assay
IC50
4.3±0.0 nM
Citation
 Murray, JKBalan, CAllgeier, AMKasparian, AViswanadhan, VWilde, CAllen, JRYoder, SCBiddlecome, GHungate, RWMiranda, LP Dipeptidyl-quinolone derivatives inhibit hypoxia inducible factor-1a prolyl hydroxylases-1, -2, and -3 with altered selectivity. J Comb Chem 12:676-86 (2010)  
Target
Name:
Prolyl hydroxylase EGLN2
Synonyms:
EGLN2 EIT6 Estrogen-induced tag 6 HIF-PH1 HPH-3 PHD1 Prolyl hydroxylase domain-containing protein 1 (PHD1)
Type:
Protein
Mol. Mass.:
43657.01
Organism:
Homo sapiens (Human)
Description:
Q96KS0
Residue:
407
  
Inhibitor
Name:
BDBM93422
Synonyms:
PHD Inhibitor, 12{1,1,2}
Type:
Small molecule
Emp. Form.:
C38H37N5O8
Mol. Mass.:
691.7291
SMILES:
CC(=O)N[C@@H](Cc1ccc2ccccc2c1)C(=O)N[C@@H](Cc1ccccc1)C(=O)NCc1ccc2n(C)c(=O)c(C(=O)NCC(O)=O)c(O)c2c1
: