Target
Cathepsin L2
Ligand
BDBM93436
Substrate
Meas. Tech.
Inhibition Activity Assay
pH
5.5±0
Temperature
300.15±0 K
IC50
>5.0e+4±n/a nM
Citation
 Alvim, JSeverino, RPMarques, EFMartinelli, AMVieira, PCFernandes, JBda Silva, MFCorrêa, AG Solution phase synthesis of a combinatorial library of chalcones and flavones as potent cathepsin V inhibitors. J Comb Chem 12:687-95 (2010)  
Target
Name:
Cathepsin L2
Synonyms:
CATL2 CTSL2 CTSV Cathepsin V
Type:
Enzyme
Mol. Mass.:
37341.06
Organism:
Homo sapiens (Human)
Description:
O60911
Residue:
334
  
Inhibitor
Name:
BDBM93436
Synonyms:
Flavonid, 5c
Type:
Small molecule
Emp. Form.:
C22H18O4
Mol. Mass.:
346.3759
SMILES:
COc1cccc(\C=C\C(=O)c2ccc(Oc3ccccc3)cc2O)c1
: