Target
Cathepsin L2
Ligand
BDBM93445
Substrate
Meas. Tech.
Inhibition Activity Assay
pH
5.5±0
Temperature
300.15±0 K
IC50
1.6e+3± 2e+2 nM
Citation
 Alvim, JSeverino, RPMarques, EFMartinelli, AMVieira, PCFernandes, JBda Silva, MFCorrêa, AG Solution phase synthesis of a combinatorial library of chalcones and flavones as potent cathepsin V inhibitors. J Comb Chem 12:687-95 (2010)  
Target
Name:
Cathepsin L2
Synonyms:
CATL2 CTSL2 CTSV Cathepsin V
Type:
Enzyme
Mol. Mass.:
37341.06
Organism:
Homo sapiens (Human)
Description:
O60911
Residue:
334
  
Inhibitor
Name:
BDBM93445
Synonyms:
Flavonid, 6[3,2]
Type:
Small molecule
Emp. Form.:
C17H13FO4
Mol. Mass.:
300.2811
SMILES:
COc1ccc(c(OC)c1)-c1cc(=O)c2cc(F)ccc2o1
: