Target
Beta-lactamase
Ligand
BDBM54499
Substrate
IC50
17165±n/a nM
Citation
 PubChem, PC Counterscreen for inhibitors of the interaction of nucleotide-binding oligomerization domain containing 2 (NOD2) and receptor-interacting serine-threonine kinase 2 (RIPK2) PubChem Bioassay (2012)[AID] 
Target
Name:
Beta-lactamase
Synonyms:
Beta lactamase
Type:
Enzyme Catalytic Domain
Mol. Mass.:
31513.38
Organism:
Pseudomonas aeruginosa
Description:
gi_114881106
Residue:
286
  
Inhibitor
Name:
BDBM54499
Synonyms:
3-(benzenesulfonyl)-N-[3-(dimethylamino)propyl]-N-(4-methoxy-1,3-benzothiazol-2-yl)propanamide MLS001124293 SMR000628955 | cid_16808764
Type:
Small organic molecule
Emp. Form.:
C22H27N3O4S2
Mol. Mass.:
461.597
SMILES:
COc1cccc2sc(nc12)N(CCCN(C)C)C(=O)CCS(=O)(=O)c1ccccc1
: