Target
Sentrin-specific protease 8
Ligand
BDBM61232
Substrate
IC50
377±38 nM
Citation
 PubChem, PC Dose-response confirmation of uHTS inhibitor hits of Sentrin-Specific Protease 8 using a kinetic assay with Nedd8 Protein Substrate PubChem Bioassay (2012)[AID] 
Target
Name:
Sentrin-specific protease 8
Synonyms:
DEN1 PRSC2 SENP8_HUMAN | SUMO/sentrin specific peptidase family member 8
Type:
Enzyme Catalytic Domain
Mol. Mass.:
24104.52
Organism:
Homo sapiens (Human)
Description:
gi_262118306
Residue:
212
  
Inhibitor
Name:
BDBM61232
Synonyms:
(2-bromanyl-4,5-dimethoxy-phenyl)-(6,7-dimethoxyisoquinolin-1-yl)methanone (2-bromo-4,5-dimethoxyphenyl)(6,7-dimethoxy-1-isoquinolinyl)methanone (2-bromo-4,5-dimethoxyphenyl)-(6,7-dimethoxyisoquinolin-1-yl)methanone SMR000498332 | cid_2974206
Type:
Small organic molecule
Emp. Form.:
C20H18BrNO5
Mol. Mass.:
432.265
SMILES:
COc1cc(Br)c(cc1OC)C(=O)c1nccc2cc(OC)c(OC)cc12
: