Target
Protein skinhead-1
Ligand
BDBM93856
Substrate
IC50
10300±n/a nM
Citation
 PubChem, PC Dose ResponseConfirmation of SKN-1 Inhibitor hits in a fluorescence ratio assay - Set 2 PubChem Bioassay (2012)[AID] 
Target
Name:
Protein skinhead-1
Synonyms:
SKN1_CAEEL skn-1
Type:
Enzyme Catalytic Domain
Mol. Mass.:
70701.17
Organism:
Caenorhabditis elegans
Description:
P34707
Residue:
623
  
Inhibitor
Name:
BDBM93856
Synonyms:
3-(5-bromobenzo[b]furan-2-yl)-1H-pyrazole 5-(5-bromo-1-benzofuran-2-yl)-1H-pyrazole 5-(5-bromobenzofuran-2-yl)-1H-pyrazole SMR000457717 | cid_2805330
Type:
Small organic molecule
Emp. Form.:
C11H7BrN2O
Mol. Mass.:
263.09
SMILES:
Brc1ccc2oc(cc2c1)-c1cc[nH]n1
: