Target
Protein skinhead-1
Ligand
BDBM93876
Substrate
IC50
7010±n/a nM
Citation
 PubChem, PC Dose ResponseConfirmation of SKN-1 Inhibitor hits in a fluorescence ratio assay - Set 2 PubChem Bioassay (2012)[AID] 
Target
Name:
Protein skinhead-1
Synonyms:
SKN1_CAEEL skn-1
Type:
Enzyme Catalytic Domain
Mol. Mass.:
70701.17
Organism:
Caenorhabditis elegans
Description:
P34707
Residue:
623
  
Inhibitor
Name:
BDBM93876
Synonyms:
4-(4-fluorophenyl)-N-(2-pyridinyl)-2-thiazolamine MLS001206910 [4-(4-Fluoro-phenyl)-thiazol-2-yl]-pyridin-2-yl-amine cid_1092430
Type:
Small organic molecule
Emp. Form.:
C14H10FN3S
Mol. Mass.:
271.313
SMILES:
Fc1ccc(cc1)-c1csc(Nc2ccccn2)n1
: