Target
Heat shock protein HSP 90-alpha
Ligand
BDBM279694
Substrate
Meas. Tech.
HSP90 Competition Binding (Fluorescence Polarization) Assay
pH
7.3±n/a
IC50
550±n/a nM
Comments
extracted
Citation
 Cai, XQian, CZhai, H Fused amino pyridine as HSP90 inhibitors US Patent  US10035797 Publication Date 7/31/2018 
Target
Name:
Heat shock protein HSP 90-alpha
Synonyms:
HS90A_HUMAN HSP86 HSP90AA1 HSPCA Heat shock 86 kDa Heat shock protein HSP 90-alpha (HSP90) LAP-2 Lipopolysaccharide-associated protein 2 heat shock protein 90kDa alpha (cytosolic), class A member 1 isoform 2
Type:
Molecular Chaperone
Mol. Mass.:
84623.45
Organism:
Homo sapiens (Human)
Description:
P07900
Residue:
732
  
Inhibitor
Name:
BDBM279694
Synonyms:
US10035797, Compound 33 US11560377, Compound 33 | US9630965, Compound 33
Type:
Small organic molecule
Emp. Form.:
C20H24BrN5O2S
Mol. Mass.:
478.406
SMILES:
CC(C)(C)CNCCn1c(Sc2cc3OCOc3cc2Br)nc2c(N)nccc12
: