Target
Protein Wnt-3a
Ligand
BDBM89238
Substrate
IC50
>50000±n/a nM
Citation
 PubChem, PC Dose response validation of uHTS Gli-SUFU antagonist hits in a Wnt3a luminescent reporter assay PubChem Bioassay (2012)[AID] 
Target
Name:
Protein Wnt-3a
Synonyms:
WNT3A_MOUSE Wnt3a | protein Wnt-3a precursor
Type:
PROTEIN
Mol. Mass.:
39269.29
Organism:
Mus musculus
Description:
ChEMBL_813156
Residue:
352
  
Inhibitor
Name:
BDBM89238
Synonyms:
1-[4-[2-hydroxy-3-(2-methyl-1-benzimidazolyl)propoxy]phenyl]-1-propanone 1-[4-[3-(2-methylbenzimidazol-1-yl)-2-oxidanyl-propoxy]phenyl]propan-1-one MLS000049410 cid_2950064
Type:
Small organic molecule
Emp. Form.:
C20H22N2O3
Mol. Mass.:
338.4003
SMILES:
CCC(=O)c1ccc(OCC(O)Cn2c(C)nc3ccccc23)cc1
: