Target
Protein Wnt-3a
Ligand
BDBM89249
Substrate
IC50
5490±n/a nM
Citation
 PubChem, PC Dose response validation of uHTS Gli-SUFU antagonist hits in a Wnt3a luminescent reporter assay PubChem Bioassay (2012)[AID] 
Target
Name:
Protein Wnt-3a
Synonyms:
WNT3A_MOUSE Wnt3a | protein Wnt-3a precursor
Type:
PROTEIN
Mol. Mass.:
39269.29
Organism:
Mus musculus
Description:
ChEMBL_813156
Residue:
352
  
Inhibitor
Name:
BDBM89249
Synonyms:
(4-Benzothiazol-2-yl-piperazin-1-yl)-[4-(4-fluoro-benzyl)-4H-thieno[3,2-b]pyrrol-5-yl]-methanone SMR000121469 [4-(1,3-benzothiazol-2-yl)piperazin-1-yl]-[4-[(4-fluorophenyl)methyl]thieno[3,2-b]pyrrol-5-yl]methanone cid_1427983
Type:
Small organic molecule
Emp. Form.:
C25H21FN4OS2
Mol. Mass.:
476.589
SMILES:
Fc1ccc(Cn2c(cc3sccc23)C(=O)N2CCN(CC2)c2nc3ccccc3s2)cc1
: