Target
Protein Wnt-3a
Ligand
BDBM89292
Substrate
IC50
441±n/a nM
Citation
 PubChem, PC Dose response validation of uHTS Gli-SUFU antagonist hits in a Wnt3a luminescent reporter assay PubChem Bioassay (2012)[AID] 
Target
Name:
Protein Wnt-3a
Synonyms:
WNT3A_MOUSE Wnt3a | protein Wnt-3a precursor
Type:
PROTEIN
Mol. Mass.:
39269.29
Organism:
Mus musculus
Description:
ChEMBL_813156
Residue:
352
  
Inhibitor
Name:
BDBM89292
Synonyms:
2,3-dihydro-1,4-benzodioxin-3-ylmethyl-(5,6-dimethylthieno[2,3-d]pyrimidin-4-yl)amine N-(2,3-dihydro-1,4-benzodioxin-3-ylmethyl)-5,6-dimethyl-4-thieno[2,3-d]pyrimidinamine N-(2,3-dihydro-1,4-benzodioxin-3-ylmethyl)-5,6-dimethylthieno[2,3-d]pyrimidin-4-amine cid_5253159
Type:
Small organic molecule
Emp. Form.:
C17H17N3O2S
Mol. Mass.:
327.401
SMILES:
Cc1sc2ncnc(NCC3COc4ccccc4O3)c2c1C
: