Target
Protein Wnt-3a
Ligand
BDBM89423
Substrate
IC50
1030±n/a nM
Citation
 PubChem, PC Dose response validation of uHTS Gli-SUFU antagonist hits in a Wnt3a luminescent reporter assay PubChem Bioassay (2012)[AID] 
Target
Name:
Protein Wnt-3a
Synonyms:
WNT3A_MOUSE Wnt3a | protein Wnt-3a precursor
Type:
PROTEIN
Mol. Mass.:
39269.29
Organism:
Mus musculus
Description:
ChEMBL_813156
Residue:
352
  
Inhibitor
Name:
BDBM89423
Synonyms:
2-(benzenesulfonyl)-N-(3-ethyl-4-methoxy-1,3-benzothiazol-2-ylidene)acetamide MLS001235139 SMR000808560 | cid_16799546
Type:
Small organic molecule
Emp. Form.:
C18H18N2O4S2
Mol. Mass.:
390.477
SMILES:
CCn1c2c(OC)cccc2sc1=NC(=O)CS(=O)(=O)c1ccccc1
: