Target
Heat shock protein hsp-16.2
Ligand
BDBM93837
Substrate
IC50
42300±n/a nM
Citation
 PubChem, PC Dose Response Confirmation of SKN-1 Inhibitor hits via a heat-shock counterscreen assay PubChem Bioassay (2012)[AID] 
Target
Name:
Heat shock protein hsp-16.2
Synonyms:
HSP12_CAEEL hsp-16 hsp16-2
Type:
Enzyme Catalytic Domain
Mol. Mass.:
16239.18
Organism:
Caenorhabditis elegans
Description:
gi_373219859
Residue:
145
  
Inhibitor
Name:
BDBM93837
Synonyms:
2-chloranyl-5-[(4-nitrophenoxy)methyl]-1,3-thiazole 2-chloro-5-[(4-nitrophenoxy)methyl]thiazole SMR000335067 | cid_1484584
Type:
Small organic molecule
Emp. Form.:
C10H7ClN2O3S
Mol. Mass.:
270.692
SMILES:
[O-][N+](=O)c1ccc(OCc2cnc(Cl)s2)cc1
: