Target
Heat shock protein hsp-16.2
Ligand
BDBM93709
Substrate
IC50
48400±n/a nM
Citation
 PubChem, PC Dose Response Confirmation of SKN-1 Inhibitor hits via a heat-shock counterscreen assay PubChem Bioassay (2012)[AID] 
Target
Name:
Heat shock protein hsp-16.2
Synonyms:
HSP12_CAEEL hsp-16 hsp16-2
Type:
Enzyme Catalytic Domain
Mol. Mass.:
16239.18
Organism:
Caenorhabditis elegans
Description:
gi_373219859
Residue:
145
  
Inhibitor
Name:
BDBM93709
Synonyms:
1-(4-phenylphenyl)imidazole SMR000065631 | cid_677923
Type:
Small organic molecule
Emp. Form.:
C15H12N2
Mol. Mass.:
220.2692
SMILES:
c1cn(cn1)-c1ccc(cc1)-c1ccccc1
: