Target
Heat shock protein hsp-16.2
Ligand
BDBM93902
Substrate
IC50
>64000±n/a nM
Citation
 PubChem, PC Dose Response Confirmation of SKN-1 Inhibitor hits via a heat-shock counterscreen assay PubChem Bioassay (2012)[AID] 
Target
Name:
Heat shock protein hsp-16.2
Synonyms:
HSP12_CAEEL hsp-16 hsp16-2
Type:
Enzyme Catalytic Domain
Mol. Mass.:
16239.18
Organism:
Caenorhabditis elegans
Description:
gi_373219859
Residue:
145
  
Inhibitor
Name:
BDBM93902
Synonyms:
3-(4-benzyl-7-chloro-3-keto-quinoxalin-2-yl)-N-[2-(dimethylamino)-2-phenyl-ethyl]propionamide 3-[7-chloranyl-3-oxidanylidene-4-(phenylmethyl)quinoxalin-2-yl]-N-[2-(dimethylamino)-2-phenyl-ethyl]propanamide MLS001079652 cid_24978977
Type:
Small organic molecule
Emp. Form.:
C28H29ClN4O2
Mol. Mass.:
489.008
SMILES:
CN(C)C(CNC(=O)CCc1nc2cc(Cl)ccc2n(Cc2ccccc2)c1=O)c1ccccc1
: