Target
Heat shock protein hsp-16.2
Ligand
BDBM37242
Substrate
IC50
33500±n/a nM
Citation
 PubChem, PC Dose Response Confirmation of SKN-1 Inhibitor hits via a heat-shock counterscreen assay PubChem Bioassay (2012)[AID] 
Target
Name:
Heat shock protein hsp-16.2
Synonyms:
HSP12_CAEEL hsp-16 hsp16-2
Type:
Enzyme Catalytic Domain
Mol. Mass.:
16239.18
Organism:
Caenorhabditis elegans
Description:
gi_373219859
Residue:
145
  
Inhibitor
Name:
BDBM37242
Synonyms:
5-(4-ethylphenyl)-3-(4-pyridyl)-1,2,4-oxadiazole MLS000109137 cid_867086
Type:
Small organic molecule
Emp. Form.:
C15H13N3O
Mol. Mass.:
251.2832
SMILES:
CCc1ccc(cc1)-c1nc(no1)-c1ccncc1
: