Target
Heat shock protein hsp-16.2
Ligand
BDBM93711
Substrate
IC50
>64000±n/a nM
Citation
 PubChem, PC Dose Response Confirmation of SKN-1 Inhibitor hits via a heat-shock counterscreen assay PubChem Bioassay (2012)[AID] 
Target
Name:
Heat shock protein hsp-16.2
Synonyms:
HSP12_CAEEL hsp-16 hsp16-2
Type:
Enzyme Catalytic Domain
Mol. Mass.:
16239.18
Organism:
Caenorhabditis elegans
Description:
gi_373219859
Residue:
145
  
Inhibitor
Name:
BDBM93711
Synonyms:
2-(2,4-dichlorophenyl)-5-phenyl-1,3,4-oxadiazole SMR000064579 | cid_96854
Type:
Small organic molecule
Emp. Form.:
C14H8Cl2N2O
Mol. Mass.:
291.132
SMILES:
Clc1ccc(-c2nnc(o2)-c2ccccc2)c(Cl)c1
: