Target
Heat shock protein hsp-16.2
Ligand
BDBM93724
Substrate
IC50
>64000±n/a nM
Citation
 PubChem, PC Dose Response Confirmation of SKN-1 Inhibitor hits via a heat-shock counterscreen assay PubChem Bioassay (2012)[AID] 
Target
Name:
Heat shock protein hsp-16.2
Synonyms:
HSP12_CAEEL hsp-16 hsp16-2
Type:
Enzyme Catalytic Domain
Mol. Mass.:
16239.18
Organism:
Caenorhabditis elegans
Description:
gi_373219859
Residue:
145
  
Inhibitor
Name:
BDBM93724
Synonyms:
5-(5-bromanylfuran-2-yl)-3-phenyl-1,2,4-oxadiazole 5-(5-bromo-2-furyl)-3-phenyl-1,2,4-oxadiazole MLS000063153 cid_752705
Type:
Small organic molecule
Emp. Form.:
C12H7BrN2O2
Mol. Mass.:
291.1
SMILES:
Brc1ccc(o1)-c1nc(no1)-c1ccccc1
: