Target
Heat shock protein hsp-16.2
Ligand
BDBM39495
Substrate
IC50
4250±n/a nM
Citation
 PubChem, PC Dose Response Confirmation of SKN-1 Inhibitor hits via a heat-shock counterscreen assay PubChem Bioassay (2012)[AID] 
Target
Name:
Heat shock protein hsp-16.2
Synonyms:
HSP12_CAEEL hsp-16 hsp16-2
Type:
Enzyme Catalytic Domain
Mol. Mass.:
16239.18
Organism:
Caenorhabditis elegans
Description:
gi_373219859
Residue:
145
  
Inhibitor
Name:
BDBM39495
Synonyms:
MLS000062478 N-[4-(4-morpholinylmethyl)phenyl]-2-benzofurancarboxamide N-[4-(morpholinomethyl)phenyl]coumarilamide cid_892458
Type:
Small organic molecule
Emp. Form.:
C20H20N2O3
Mol. Mass.:
336.3844
SMILES:
O=C(Nc1ccc(CN2CCOCC2)cc1)c1cc2ccccc2o1
: