Target
Endothelial PAS domain-containing protein 1
Ligand
BDBM93947
Substrate
IC50
6380±n/a nM
Citation
 PubChem, PC Dose response confirmation of uHTS identification of HIF-2a Inhibitors in a luminesence assay PubChem Bioassay (2012)[AID] 
Target
Name:
Endothelial PAS domain-containing protein 1
Synonyms:
BHLHE73 EPAS1_HUMAN MOP2 endothelial PAS domain-containing protein 1
Type:
PROTEIN
Mol. Mass.:
96453.58
Organism:
Homo sapiens (Human)
Description:
ChEMBL_1506501
Residue:
870
  
Inhibitor
Name:
BDBM93947
Synonyms:
3-(5-Imino-5H-[1,2,4]dithiazol-3-ylsulfanyl)-propionic acid 3-[(5-imino-1,2,4-dithiazol-3-yl)sulfanyl]propanoic acid 3-[(5-imino-1,2,4-dithiazol-3-yl)thio]propionic acid SMR000012615 | cid_654478
Type:
Small organic molecule
Emp. Form.:
C5H6N2O2S3
Mol. Mass.:
222.308
SMILES:
OC(=O)CCSc1nc(=N)ss1
: