Target
Endothelial PAS domain-containing protein 1
Ligand
BDBM38983
Substrate
IC50
1990±n/a nM
Citation
 PubChem, PC Dose response confirmation of uHTS identification of HIF-2a Inhibitors in a luminesence assay PubChem Bioassay (2012)[AID] 
Target
Name:
Endothelial PAS domain-containing protein 1
Synonyms:
BHLHE73 EPAS1_HUMAN MOP2 endothelial PAS domain-containing protein 1
Type:
PROTEIN
Mol. Mass.:
96453.58
Organism:
Homo sapiens (Human)
Description:
ChEMBL_1506501
Residue:
870
  
Inhibitor
Name:
BDBM38983
Synonyms:
MLS000045930 N-(2,5-dimethoxyphenyl)-4-[5-(4-ethoxyphenyl)-1,2-oxazol-3-yl]butanamide N-(2,5-dimethoxyphenyl)-4-[5-(4-ethoxyphenyl)isoxazol-3-yl]butanamide cid_3243514
Type:
Small organic molecule
Emp. Form.:
C23H26N2O5
Mol. Mass.:
410.4629
SMILES:
CCOc1ccc(cc1)-c1cc(CCCC(=O)Nc2cc(OC)ccc2OC)no1
: