Target
Endothelial PAS domain-containing protein 1
Ligand
BDBM94046
Substrate
IC50
<300±n/a nM
Citation
 PubChem, PC Dose response confirmation of uHTS identification of HIF-2a Inhibitors in a luminesence assay PubChem Bioassay (2012)[AID] 
Target
Name:
Endothelial PAS domain-containing protein 1
Synonyms:
BHLHE73 EPAS1_HUMAN MOP2 endothelial PAS domain-containing protein 1
Type:
PROTEIN
Mol. Mass.:
96453.58
Organism:
Homo sapiens (Human)
Description:
ChEMBL_1506501
Residue:
870
  
Inhibitor
Name:
BDBM94046
Synonyms:
4-(5-phenyl-1,3-oxazol-2-yl)aniline MLS001175174 [4-(5-phenyloxazol-2-yl)phenyl]amine | cid_854968
Type:
Small organic molecule
Emp. Form.:
C15H12N2O
Mol. Mass.:
236.2686
SMILES:
Nc1ccc(cc1)-c1ncc(o1)-c1ccccc1
: