Target
Endothelial PAS domain-containing protein 1
Ligand
BDBM64363
Substrate
IC50
1040±n/a nM
Citation
 PubChem, PC Dose response confirmation of uHTS identification of HIF-2a Inhibitors in a luminesence assay PubChem Bioassay (2012)[AID] 
Target
Name:
Endothelial PAS domain-containing protein 1
Synonyms:
BHLHE73 EPAS1_HUMAN MOP2 endothelial PAS domain-containing protein 1
Type:
PROTEIN
Mol. Mass.:
96453.58
Organism:
Homo sapiens (Human)
Description:
ChEMBL_1506501
Residue:
870
  
Inhibitor
Name:
BDBM64363
Synonyms:
4-[3-(2-chlorophenyl)-1,2,4-oxadiazol-5-yl]-N-cyclopentyl-butanamide 4-[3-(2-chlorophenyl)-1,2,4-oxadiazol-5-yl]-N-cyclopentylbutanamide SMR000625664 | cid_23605826
Type:
Small organic molecule
Emp. Form.:
C17H20ClN3O2
Mol. Mass.:
333.813
SMILES:
Clc1ccccc1-c1noc(CCCC(=O)NC2CCCC2)n1
: