Target
Corticotropin-releasing factor-binding protein
Ligand
BDBM91457
Substrate
IC50
2730±n/a nM
Citation
 PubChem, PC Dose Response confirmation of uHTS hits for small molecule antagonists of the CRF-binding protein and CRF-R2 receptor complex in 384 well format PubChem Bioassay (2012)[AID] 
Target
Name:
Corticotropin-releasing factor-binding protein
Synonyms:
CRFBP CRHBP_HUMAN | corticotropin releasing factor-binding protein
Type:
Enzyme Catalytic Domain
Mol. Mass.:
36143.95
Organism:
Homo sapiens (Human)
Description:
P24387
Residue:
322
  
Inhibitor
Name:
BDBM91457
Synonyms:
1-(1,2-diphenylethyl)-3-(3-methoxyphenyl)thiourea SMR001822025 | cid_2803089
Type:
Small organic molecule
Emp. Form.:
C22H22N2OS
Mol. Mass.:
362.488
SMILES:
COc1cccc(NC(=S)NC(Cc2ccccc2)c2ccccc2)c1
: