Target
Corticotropin-releasing factor-binding protein
Ligand
BDBM50226830
Substrate
IC50
5180±n/a nM
Citation
 PubChem, PC Dose Response confirmation of uHTS hits for small molecule antagonists of the CRF-binding protein and CRF-R2 receptor complex in 384 well format PubChem Bioassay (2012)[AID] 
Target
Name:
Corticotropin-releasing factor-binding protein
Synonyms:
CRFBP CRHBP_HUMAN | corticotropin releasing factor-binding protein
Type:
Enzyme Catalytic Domain
Mol. Mass.:
36143.95
Organism:
Homo sapiens (Human)
Description:
P24387
Residue:
322
  
Inhibitor
Name:
BDBM50226830
Synonyms:
4-hydroxy-3-((4-hydroxy-2-oxo-2H-chromen-3-yl)(4-isopropylphenyl)methyl)-2H-chromen-2-one Dicoumarol derivative, 5 | cid_54677783
Type:
Small organic molecule
Emp. Form.:
C28H22O6
Mol. Mass.:
454.4707
SMILES:
CC(C)c1ccc(cc1)C(c1c(O)c2ccccc2oc1=O)c1c(O)c2ccccc2oc1=O
: