Target
Corticotropin-releasing factor-binding protein
Ligand
BDBM51126
Substrate
IC50
1460±n/a nM
Citation
 PubChem, PC Dose Response confirmation of uHTS hits for small molecule antagonists of the CRF-binding protein and CRF-R2 receptor complex in 384 well format PubChem Bioassay (2012)[AID] 
Target
Name:
Corticotropin-releasing factor-binding protein
Synonyms:
CRFBP CRHBP_HUMAN | corticotropin releasing factor-binding protein
Type:
Enzyme Catalytic Domain
Mol. Mass.:
36143.95
Organism:
Homo sapiens (Human)
Description:
P24387
Residue:
322
  
Inhibitor
Name:
BDBM51126
Synonyms:
2-(3,4,5-trimethoxybenzylidene)indane-1,3-quinone MLS000718012 cid_827945
Type:
Small organic molecule
Emp. Form.:
C19H16O5
Mol. Mass.:
324.3273
SMILES:
[#6]-[#8]-c1cc(\[#6]=[#6]-2/[#6](=O)-c3ccccc3-[#6]-2=O)cc(-[#8]-[#6])c1-[#8]-[#6]
: