Target
Corticotropin-releasing factor-binding protein
Ligand
BDBM91193
Substrate
IC50
2210±n/a nM
Citation
 PubChem, PC Dose Response confirmation of uHTS hits for small molecule antagonists of the CRF-binding protein and CRF-R2 receptor complex in 384 well format PubChem Bioassay (2012)[AID] 
Target
Name:
Corticotropin-releasing factor-binding protein
Synonyms:
CRFBP CRHBP_HUMAN | corticotropin releasing factor-binding protein
Type:
Enzyme Catalytic Domain
Mol. Mass.:
36143.95
Organism:
Homo sapiens (Human)
Description:
P24387
Residue:
322
  
Inhibitor
Name:
BDBM91193
Synonyms:
MLS001306198 cid_6890216
Type:
Small organic molecule
Emp. Form.:
C24H20N6O3
Mol. Mass.:
440.454
SMILES:
COc1cccc(\C=N\n2c3nc4ccccc4nc3c3c2ncn(CC=C)c3=O)c1OC
: