Target
Neuropilin-1
Ligand
BDBM24679
Substrate
IC50
>95000±n/a nM
Citation
 PubChem, PC Dose Response confirmation of small molecule modulators of the interaction between CendR and NRP-1 in a panel assay PubChem Bioassay (2012)[AID] 
Target
Name:
Neuropilin-1
Synonyms:
Chain A, Crystal Structure Of The B1b2 Domains From Human Neuropilin- 1 NRP1 Neuropilin-1 | VEGF165R
Type:
PROTEIN
Mol. Mass.:
103122.09
Organism:
Homo sapiens (Human)
Description:
ChEMBL_617636
Residue:
923
  
Inhibitor
Name:
BDBM24679
Synonyms:
(6Z)-6-(3-pyrazolin-3-ylidene)cyclohexa-2,4-dien-1-one pyrazole, 32
Type:
Small organic molecule
Emp. Form.:
C9H8N2O
Mol. Mass.:
160.1726
SMILES:
Oc1ccccc1-c1cc[nH]n1
: