Target
Xylosyl- and glucuronyltransferase LARGE1
Ligand
BDBM94644
Substrate
EC50
3990±n/a nM
Citation
 PubChem, PC SAR analysis of small molecule activators of alpha dystroglycan glycosylation PubChem Bioassay (2012)[AID] 
Target
Name:
Xylosyl- and glucuronyltransferase LARGE1
Synonyms:
KIAA0609 LARGE | LARGE1
Type:
Enzyme Catalytic Domain
Mol. Mass.:
88079.63
Organism:
Homo sapiens (Human)
Description:
gi_47678551
Residue:
756
  
Inhibitor
Name:
BDBM94644
Synonyms:
4-(7-ethyl-1H-indol-3-yl)-N-methyl-1,3-thiazol-2-amine MLS-0471919.0001 cid_8036538
Type:
Small organic molecule
Emp. Form.:
C14H15N3S
Mol. Mass.:
257.354
SMILES:
CCc1cccc2c(c[nH]c12)-c1csc(NC)n1
: