Target
Arf-GAP with SH3 domain, ANK repeat and PH domain-containing protein 1
Ligand
BDBM94658
Substrate
IC50
12859±n/a nM
Citation
 PubChem, PC Fluorescence polarization-based biochemical high throughput dose response assay for inhibitors of ArfGAP with SH3 domain, ankyrin repeat and PH domain 1 (ASAP1) PubChem Bioassay (2012)[AID] 
Target
Name:
Arf-GAP with SH3 domain, ANK repeat and PH domain-containing protein 1
Synonyms:
ASAP1 DDEF1 PAG2 | arf-GAP with SH3 domain, ANK repeat and PH domain-containing protein 1 isoform 2
Type:
Enzyme Catalytic Domain
Mol. Mass.:
125507.11
Organism:
Homo sapiens (Human)
Description:
Q9ULH1
Residue:
1129
  
Inhibitor
Name:
BDBM94658
Synonyms:
(E)-1-[1-[(2,4-dichlorophenyl)methyl]-3-indolyl]-N-(1,2,4-triazol-4-yl)methanimine (E)-[1-(2,4-dichlorobenzyl)indol-3-yl]methylene-(1,2,4-triazol-4-yl)amine N-{[1-(2,4-dichlorobenzyl)-1H-indol-3-yl]methylene}-4H-1,2,4-triazol-4-amine cid_6859918
Type:
Small organic molecule
Emp. Form.:
C18H13Cl2N5
Mol. Mass.:
370.235
SMILES:
Clc1ccc(Cn2cc(\C=N\n3cnnc3)c3ccccc23)c(Cl)c1
: