Target
Arf-GAP with SH3 domain, ANK repeat and PH domain-containing protein 1
Ligand
BDBM58176
Substrate
IC50
>164711±n/a nM
Citation
 PubChem, PC Fluorescence polarization-based biochemical high throughput dose response assay for inhibitors of ArfGAP with SH3 domain, ankyrin repeat and PH domain 1 (ASAP1) PubChem Bioassay (2012)[AID] 
Target
Name:
Arf-GAP with SH3 domain, ANK repeat and PH domain-containing protein 1
Synonyms:
ASAP1 DDEF1 PAG2 | arf-GAP with SH3 domain, ANK repeat and PH domain-containing protein 1 isoform 2
Type:
Enzyme Catalytic Domain
Mol. Mass.:
125507.11
Organism:
Homo sapiens (Human)
Description:
Q9ULH1
Residue:
1129
  
Inhibitor
Name:
BDBM58176
Synonyms:
MLS000911526 N-[3-[2-(4-chloroanilino)-4-thiazolyl]phenyl]benzamide N-[3-[2-[(4-chlorophenyl)amino]-1,3-thiazol-4-yl]phenyl]benzamide cid_3925868
Type:
Small organic molecule
Emp. Form.:
C22H16ClN3OS
Mol. Mass.:
405.9
SMILES:
Clc1ccc(Nc2nc(cs2)-c2cccc(NC(=O)c3ccccc3)c2)cc1
: