Target
Xylosyl- and glucuronyltransferase LARGE1
Ligand
BDBM94751
Substrate
EC50
>80000±n/a nM
Citation
 PubChem, PC Dose response confirmation of small molecule activators of alpha dystroglycan glycosylation PubChem Bioassay (2012)[AID] 
Target
Name:
Xylosyl- and glucuronyltransferase LARGE1
Synonyms:
KIAA0609 LARGE | LARGE1
Type:
Enzyme Catalytic Domain
Mol. Mass.:
88079.63
Organism:
Homo sapiens (Human)
Description:
gi_47678551
Residue:
756
  
Inhibitor
Name:
BDBM94751
Synonyms:
MLS001122457 N-[3-(1H-indol-2-yl)phenyl]-1-[(1-propan-2-yl-4-pyrazolyl)methyl]-3-piperidinecarboxamide SMR000654609 | cid_24819222
Type:
Small organic molecule
Emp. Form.:
C27H31N5O
Mol. Mass.:
441.5679
SMILES:
CC(C)n1cc(CN2CCCC(C2)C(=O)Nc2cccc(c2)-c2cc3ccccc3[nH]2)cn1
: