Target
Xylosyl- and glucuronyltransferase LARGE1
Ligand
BDBM94763
Substrate
EC50
7860±n/a nM
Citation
 PubChem, PC Dose response confirmation of small molecule activators of alpha dystroglycan glycosylation PubChem Bioassay (2012)[AID] 
Target
Name:
Xylosyl- and glucuronyltransferase LARGE1
Synonyms:
KIAA0609 LARGE | LARGE1
Type:
Enzyme Catalytic Domain
Mol. Mass.:
88079.63
Organism:
Homo sapiens (Human)
Description:
gi_47678551
Residue:
756
  
Inhibitor
Name:
BDBM94763
Synonyms:
2-N-(2-methoxyethyl)-4-N-(2-phenoxyethyl)-6-phenylthieno[3,2-d]pyrimidine-2,4-diamine MLS003122914 N2-(2-methoxyethyl)-N4-(2-phenoxyethyl)-6-phenylthieno[3,2-d]pyrimidine-2,4-diamine cid_46943043
Type:
Small organic molecule
Emp. Form.:
C23H24N4O2S
Mol. Mass.:
420.527
SMILES:
COCCNc1nc(NCCOc2ccccc2)c2sc(cc2n1)-c1ccccc1
: