Target
Sentrin-specific protease 1
Ligand
BDBM94775
Substrate
IC50
8200±n/a nM
Citation
 PubChem, PC Dose response confirmation of small molecule inhibitors of the catalytic domain of the SUMO protease, SENP1 in a FRET assay PubChem Bioassay (2012)[AID] 
Target
Name:
Sentrin-specific protease 1
Synonyms:
SENP1 Sentrin-specific protease 1 (SENP1)
Type:
Protein
Mol. Mass.:
73500.42
Organism:
Homo sapiens (Human)
Description:
Q9P0U3
Residue:
644
  
Inhibitor
Name:
BDBM94775
Synonyms:
5-amino-2-(2-oxolanylmethyl)isoindole-1,3-dione 5-amino-2-(tetrahydro-2-furanylmethyl)-1H-isoindole-1,3(2H)-dione 5-azanyl-2-(oxolan-2-ylmethyl)isoindole-1,3-dione SMR000071562 | cid_2925042
Type:
Small organic molecule
Emp. Form.:
C13H14N2O3
Mol. Mass.:
246.2619
SMILES:
Nc1ccc2C(=O)N(CC3CCCO3)C(=O)c2c1
: