Target
Sentrin-specific protease 1
Ligand
BDBM58966
Substrate
IC50
8980±n/a nM
Citation
 PubChem, PC Dose response confirmation of small molecule inhibitors of the catalytic domain of the SUMO protease, SENP1 in a FRET assay PubChem Bioassay (2012)[AID] 
Target
Name:
Sentrin-specific protease 1
Synonyms:
SENP1 Sentrin-specific protease 1 (SENP1)
Type:
Protein
Mol. Mass.:
73500.42
Organism:
Homo sapiens (Human)
Description:
Q9P0U3
Residue:
644
  
Inhibitor
Name:
BDBM58966
Synonyms:
MLS000520196 N-cyclohexyl-2-(5-methylfuran-2-yl)imidazo[1,2-a]pyrimidin-3-amine cid_3497769 | cyclohexyl-[2-(5-methyl-2-furyl)imidazo[1,2-a]pyrimidin-3-yl]amine
Type:
Small organic molecule
Emp. Form.:
C17H20N4O
Mol. Mass.:
296.3669
SMILES:
Cc1ccc(o1)-c1nc2ncccn2c1NC1CCCCC1
: