Target
Sentrin-specific protease 1
Ligand
BDBM94844
Substrate
IC50
9310±n/a nM
Citation
 PubChem, PC Dose response confirmation of small molecule inhibitors of the catalytic domain of the SUMO protease, SENP1 in a FRET assay PubChem Bioassay (2012)[AID] 
Target
Name:
Sentrin-specific protease 1
Synonyms:
SENP1 Sentrin-specific protease 1 (SENP1)
Type:
Protein
Mol. Mass.:
73500.42
Organism:
Homo sapiens (Human)
Description:
Q9P0U3
Residue:
644
  
Inhibitor
Name:
BDBM94844
Synonyms:
MLS002234134 cid_42628567
Type:
Small organic molecule
Emp. Form.:
C25H27N5O3
Mol. Mass.:
445.5136
SMILES:
[H][C@]12CCN3C(=O)CC[C@]([H])(C[C@@]4(C1)Nc1cc(ccc1N=C4NCc1ccccc1)[N+]([O-])=O)[C@]23[H]
: