Target
Sentrin-specific protease 1
Ligand
BDBM94859
Substrate
IC50
15200±n/a nM
Citation
 PubChem, PC Dose response confirmation of small molecule inhibitors of the catalytic domain of the SUMO protease, SENP1 in a FRET assay PubChem Bioassay (2012)[AID] 
Target
Name:
Sentrin-specific protease 1
Synonyms:
SENP1 Sentrin-specific protease 1 (SENP1)
Type:
Protein
Mol. Mass.:
73500.42
Organism:
Homo sapiens (Human)
Description:
Q9P0U3
Residue:
644
  
Inhibitor
Name:
BDBM94859
Synonyms:
MLS002706983 N-[2-[[(E)-(2,4-dimethoxy-6-oxo-1-cyclohexa-2,4-dienylidene)methyl]amino]phenyl]-4-methylbenzenesulfonamide N-[2-[[(E)-(6-keto-2,4-dimethoxy-cyclohexa-2,4-dien-1-ylidene)methyl]amino]phenyl]-4-methyl-benzenesulfonamide cid_6508778
Type:
Small organic molecule
Emp. Form.:
C22H22N2O5S
Mol. Mass.:
426.485
SMILES:
COc1cc(O)c(C=Nc2ccccc2NS(=O)(=O)c2ccc(C)cc2)c(OC)c1
: