Target
Sentrin-specific protease 1
Ligand
BDBM94868
Substrate
IC50
8470±n/a nM
Citation
 PubChem, PC Dose response confirmation of small molecule inhibitors of the catalytic domain of the SUMO protease, SENP1 in a FRET assay PubChem Bioassay (2012)[AID] 
Target
Name:
Sentrin-specific protease 1
Synonyms:
SENP1 Sentrin-specific protease 1 (SENP1)
Type:
Protein
Mol. Mass.:
73500.42
Organism:
Homo sapiens (Human)
Description:
Q9P0U3
Residue:
644
  
Inhibitor
Name:
BDBM94868
Synonyms:
4-[6-chloranyl-3-[[2-(trifluoromethyl)phenyl]methyl]imidazo[1,2-a]pyridin-2-yl]benzenecarbonitrile 4-[6-chloro-3-[[2-(trifluoromethyl)phenyl]methyl]-2-imidazo[1,2-a]pyridinyl]benzonitrile MLS003270000 cid_51361317
Type:
Small organic molecule
Emp. Form.:
C22H13ClF3N3
Mol. Mass.:
411.807
SMILES:
FC(F)(F)c1ccccc1Cc1c(nc2ccc(Cl)cn12)-c1ccc(cc1)C#N
: