Target
Sentrin-specific protease 1
Ligand
BDBM94792
Substrate
IC50
11200±n/a nM
Citation
 PubChem, PC Dose response confirmation of small molecule inhibitors of the catalytic domain of the SUMO protease, SENP1 in a kinetic FRET assay PubChem Bioassay (2012)[AID] 
Target
Name:
Sentrin-specific protease 1
Synonyms:
SENP1 Sentrin-specific protease 1 (SENP1)
Type:
Protein
Mol. Mass.:
73500.42
Organism:
Homo sapiens (Human)
Description:
Q9P0U3
Residue:
644
  
Inhibitor
Name:
BDBM94792
Synonyms:
2-fluoranyl-N-[(E)-1-(10H-phenothiazin-2-yl)ethylideneamino]benzamide MLS000390758 cid_9682488
Type:
Small organic molecule
Emp. Form.:
C21H16FN3OS
Mol. Mass.:
377.435
SMILES:
CC(=NNC(=O)c1ccccc1F)c1ccc2Sc3ccccc3Nc2c1
: