Target
Sentrin-specific protease 1
Ligand
BDBM52649
Substrate
IC50
21500±n/a nM
Citation
 PubChem, PC Dose response confirmation of small molecule inhibitors of the catalytic domain of the SUMO protease, SENP1 in a kinetic FRET assay PubChem Bioassay (2012)[AID] 
Target
Name:
Sentrin-specific protease 1
Synonyms:
SENP1 Sentrin-specific protease 1 (SENP1)
Type:
Protein
Mol. Mass.:
73500.42
Organism:
Homo sapiens (Human)
Description:
Q9P0U3
Residue:
644
  
Inhibitor
Name:
BDBM52649
Synonyms:
4-(3-benzyl-4-keto-thiazolidin-2-yl)-N-isobutyl-benzamide MLS000717159 N-(2-methylpropyl)-4-[4-oxo-3-(phenylmethyl)-2-thiazolidinyl]benzamide cid_3139076
Type:
Small organic molecule
Emp. Form.:
C21H24N2O2S
Mol. Mass.:
368.492
SMILES:
CC(C)CNC(=O)c1ccc(cc1)C1SCC(=O)N1Cc1ccccc1
: