Target
Sentrin-specific protease 1
Ligand
BDBM94854
Substrate
IC50
14100±n/a nM
Citation
 PubChem, PC Dose response confirmation of small molecule inhibitors of the catalytic domain of the SUMO protease, SENP1 in a kinetic FRET assay PubChem Bioassay (2012)[AID] 
Target
Name:
Sentrin-specific protease 1
Synonyms:
SENP1 Sentrin-specific protease 1 (SENP1)
Type:
Protein
Mol. Mass.:
73500.42
Organism:
Homo sapiens (Human)
Description:
Q9P0U3
Residue:
644
  
Inhibitor
Name:
BDBM94854
Synonyms:
1-[2-(dimethylamino)ethylamino]-4-(hydroxymethyl)-7-oxidanyl-xanthen-9-one 1-[2-(dimethylamino)ethylamino]-7-hydroxy-4-(hydroxymethyl)xanthen-9-one 9H-Xanthen-9-one, 1-[[2-(dimethylamino)ethyl]amino]- 7-hydroxy-4-(hydroxymethyl)- SMR001566706 | cid_337396
Type:
Small organic molecule
Emp. Form.:
C18H20N2O4
Mol. Mass.:
328.3624
SMILES:
CN(C)CCNc1ccc(CO)c2oc3ccc(O)cc3c(=O)c12
: